{"text_format":"1","workbook":"xlsx","n_sheets":7,"sheets":["Blank Template","Risk Summary Table","Scoring Matrix","Abbreviations","Financial Sustainability","Estates and Facilities","Education (UG and PGT)"],"not_rendered":{"charts":0,"images":0,"macros":1,"external_links":0,"defined_names":6,"comments":0,"pivot_tables":0},"unopened":[],"bounds":{"document_bytes":16777216,"sheet_cells":100000,"rows_first":2000,"rows_last":500,"rows_between":2000,"halvings":0,"cell_chars":16384,"cell_head_chars":4096},"cells_cut":0,"cells_raw":0,"read":"whole","date_system":"1900"}

{"sheet":"Blank Template","index":0,"n_rows":27,"n_cols":20,"rows_kept":27,"cut":false,"hidden":true,"merged":[[2,8,2,10],[2,16,2,18],[0,3,0,5],[0,1,0,2]]}
[null,"Strategic Risk Area:"]
[]
[null,"No.","Risk  (what could happen)","Risk Owner","Risk Manager","Consequences (how would this affect the University)","Likelihood","Impact","Unmitigated Score\n(gross)",null,null,"Response","Mitigations (what is being/has been done to control the risk) ","Status (in place/in progress/under consideration)","Likelihood","Impact","Mitigated Score\n(net)",null,null,"Risk Movement"]
[null,null,null,null,null,null,null,null,"n",{"$f":"IF(K4<4,\"GREEN\",IF(AND(K4>3,K4<7),\"YELLOW\",IF(AND(K4>7,K4<10),\"AMBER\",IF(AND(K4>9,K4<17),\"RED\",\"ERROR\"))))","v":"GREEN"},{"$f":"G4*H4","v":0},null,null,null,null,null,"n",{"$f":"IF(S4<4,\"GREEN\",IF(AND(S4>3,S4<7),\"YELLOW\",IF(AND(S4>7,S4<10),\"AMBER\",IF(AND(S4>9,S4<17),\"RED\",\"ERROR\"))))","v":"GREEN"},{"$f":"O4*P4","v":0},"Up"]
[null,null,null,null,null,null,null,null,"n",{"$f":"IF(K5<4,\"GREEN\",IF(AND(K5>3,K5<7),\"YELLOW\",IF(AND(K5>7,K5<10),\"AMBER\",IF(AND(K5>9,K5<17),\"RED\",\"ERROR\"))))","v":"GREEN"},0,null,null,null,null,null,"n",{"$f":"IF(S5<4,\"GREEN\",IF(AND(S5>3,S5<7),\"YELLOW\",IF(AND(S5>7,S5<10),\"AMBER\",IF(AND(S5>9,S5<17),\"RED\",\"ERROR\"))))","v":"GREEN"},{"$f":"O5*P5","v":0},"Down"]
[null,null,null,null,null,null,null,null,"n",{"$f":"IF(K6<4,\"GREEN\",IF(AND(K6>3,K6<7),\"YELLOW\",IF(AND(K6>7,K6<10),\"AMBER\",IF(AND(K6>9,K6<17),\"RED\",\"ERROR\"))))","v":"GREEN"},0,null,null,null,null,null,"n",{"$f":"IF(S6<4,\"GREEN\",IF(AND(S6>3,S6<7),\"YELLOW\",IF(AND(S6>7,S6<10),\"AMBER\",IF(AND(S6>9,S6<17),\"RED\",\"ERROR\"))))","v":"GREEN"},0,"No Change"]
{"$rows_left_out":22}
{"sheet":"Risk Summary Table","index":1,"n_rows":21,"n_cols":8,"rows_kept":21,"cut":false,"hidden":false,"merged":[[1,2,1,5],[1,1,2,1],[1,0,2,0],[0,0,0,6]]}
["University of Aberdeen: Strategic Risk Register (SRR)"]
[null,"Risk Areas","Count of Risks"]
[null,null,"Green","Yellow","Amber","Red","Total","% of Total"]
[{"$f":"ROW()-4","v":0},null,{"$f":"IFERROR(COUNTIFS(INDIRECT(\"'\"&LEFT($B4,31)&\"'!$S$4:$S$27\"),\"<4\",INDIRECT(\"'\"&LEFT($B4,31)&\"'!$S$4:$S$27\"),\">0\"),0)","v":0},{"$f":"IFERROR(COUNTIFS(INDIRECT(\"'\"&LEFT($B4,31)&\"'!$S$4:$S$27\"),\"<7\",INDIRECT(\"'\"&LEFT($B4,31)&\"'!$S$4:$S$27\"),\">3\"),0)","v":0},{"$f":"IFERROR(COUNTIFS(INDIRECT(\"'\"&LEFT($B4,31)&\"'!$S$4:$S$27\"),\"<10\",INDIRECT(\"'\"&LEFT($B4,31)&\"'!$S$4:$S$27\"),\">6\"),0)","v":0},{"$f":"IFERROR(COUNTIFS(INDIRECT(\"'\"&LEFT($B4,31)&\"'!$S$4:$S$27\"),\"<17\",INDIRECT(\"'\"&LEFT($B4,31)&\"'!$S$4:$S$27\"),\">9\"),0)","v":0}]
[{"$f":"ROW()-4","v":1},{"$f":"LEFT('Financial Sustainability'!D1,31)","v":"Financial Sustainability"},{"$f":"IFERROR(COUNTIFS(INDIRECT(\"'\"&LEFT($B5,31)&\"'!$S$4:$S$27\"),\"<4\",INDIRECT(\"'\"&LEFT($B5,31)&\"'!$S$4:$S$27\"),\">0\"),0)","v":0},{"$f":"IFERROR(COUNTIFS(INDIRECT(\"'\"&LEFT($B5,31)&\"'!$S$4:$S$27\"),\"<7\",INDIRECT(\"'\"&LEFT($B5,31)&\"'!$S$4:$S$27\"),\">3\"),0)","v":1},{"$f":"IFERROR(COUNTIFS(INDIRECT(\"'\"&LEFT($B5,31)&\"'!$S$4:$S$27\"),\"<10\",INDIRECT(\"'\"&LEFT($B5,31)&\"'!$S$4:$S$27\"),\">6\"),0)","v":7},{"$f":"IFERROR(COUNTIFS(INDIRECT(\"'\"&LEFT($B5,31)&\"'!$S$4:$S$27\"),\"<17\",INDIRECT(\"'\"&LEFT($B5,31)&\"'!$S$4:$S$27\"),\">9\"),0)","v":4},{"$f":"SUM(C5:F5)","v":12},{"$f":"G5/G20","v":0.38709677419354838}]
[{"$f":"ROW()-4","v":2},{"$f":"LEFT('Estates and Facilities'!D1,31)","v":"Estates and Facilities"},{"$f":"IFERROR(COUNTIFS(INDIRECT(\"'\"&LEFT($B6,31)&\"'!$S$4:$S$27\"),\"<4\",INDIRECT(\"'\"&LEFT($B6,31)&\"'!$S$4:$S$27\"),\">0\"),0)","v":0},{"$f":"IFERROR(COUNTIFS(INDIRECT(\"'\"&LEFT($B6,31)&\"'!$S$4:$S$27\"),\"<7\",INDIRECT(\"'\"&LEFT($B6,31)&\"'!$S$4:$S$27\"),\">3\"),0)","v":2},{"$f":"IFERROR(COUNTIFS(INDIRECT(\"'\"&LEFT($B6,31)&\"'!$S$4:$S$27\"),\"<10\",INDIRECT(\"'\"&LEFT($B6,31)&\"'!$S$4:$S$27\"),\">6\"),0)","v":6},{"$f":"IFERROR(COUNTIFS(INDIRECT(\"'\"&LEFT($B6,31)&\"'!$S$4:$S$27\"),\"<17\",INDIRECT(\"'\"&LEFT($B6,31)&\"'!$S$4:$S$27\"),\">9\"),0)","v":4},12,{"$f":"G6/G20","v":0.38709677419354838}]
{"$rows_left_out":16}
{"sheet":"Scoring Matrix","index":2,"n_rows":9,"n_cols":18,"rows_kept":9,"cut":false,"hidden":false,"merged":[[5,1,8,1],[3,3,3,6]]}
[]
[]
[]
[null,null,null,"Impact"]
[null,null,null,"Low (1)","Moderate (2)","High (3)","Critical (4)",null,null,null,null,null,null,null,null,null,null,"Avoid"]
[null,"Likelihood","Highly Likely (4)",4,8,12,16,null,null,null,null,null,null,null,null,null,null,"Treat"]
{"$rows_left_out":4}
{"sheet":"Abbreviations","index":3,"n_rows":19,"n_cols":2,"rows_kept":19,"cut":false,"hidden":false,"merged":[]}
["Risk Owners and Managers: abbreviations"]
[]
["SVP","Senior Vice-Principal"]
["US & COO","University Secretary and Chief Operating Officer"]
["CFO","Chief Financial Officer"]
["DD ER","Deputy Director External Relations"]
{"$rows_left_out":14}
{"sheet":"Financial Sustainability","index":4,"n_rows":15,"n_cols":20,"rows_kept":15,"cut":false,"hidden":false,"merged":[[2,8,2,10],[2,16,2,18],[0,3,0,5],[0,1,0,2]]}
[null,"Strategic Risk Area:",null,"Financial Sustainability"]
[]
[null,"No.","Risk  (what could happen)","Risk Owner","Risk Manager","Consequences (how would this affect the University)","Likelihood","Impact","Unmitigated Score\n(gross)",null,null,"Response","Mitigations (what is being/has been done to control the risk) ","Status (in place/in progress/under consideration)","Likelihood","Impact","Mitigated Score\n(net)",null,null,"Risk Movement"]
[null,1,"Failure to meet loan covenants and associated impact on going concern assurance.","SVP","CFO","The University would need to open discussions with loan providers, the SFC and USS if covenant tests were not met. In an extreme situation, lenders may require repayment of loans which would also trigger loan break penalty costs. It is not possible to estimate these costs as each lender / stakeholder will have different responses. \n\nCurrent tuition fee shortfall has meant that debt service covenant is under pressure.  ",3,4,"n",{"$f":"IF(K4<4,\"GREEN\",IF(AND(K4>3,K4<7),\"YELLOW\",IF(AND(K4>7,K4<10),\"AMBER\",IF(AND(K4>9,K4<17),\"RED\",\"ERROR\"))))","v":"RED"},{"$f":"G4*H4","v":12},"Treat","Lobbying Universities Scotland (US), UUK, USS\n\nThe USS members have recently accepted a short term settlement which has capped the Pension contributions by employers for the next three years, subject to the 2023 valuation, thereby reducing the largest recent risk in this area.\n\nFinance prepare modelling tests for compliance with covenants at least twice a year. If a breach was anticipated (and so far it has not) from such modelling, we would negotiate with lenders and other stakeholders (eg SFC and USS) to develop solutions. \n\nInvestment Committee manages asset allocation using fund management experts to achieve a balanced risk profile.\n\nThe current financial projection indicates the £1.9m projected deficit should be achieved for 2022/23. This will ensure covenance compliance.                                                                                     In June Court approved the 3 year financial plan which predicts a deficit in 2023/24 of £3.9m, largely to reflect the full REF cut. The Plan projects break-even in 2024/25 and a surplus of £3m in 2025/26. Each of these financial results will achieve covenant compliance. However, the financial plan includes both ambitious (but realistic) growth in student fee income, controlled cost reduction and an assumed level of additional income through philantrothopic sources.","In place \n\n\n\n\n                                                                                                                                                                                                                                                                                                                ",3,4,"n",{"$f":"IF(S4<4,\"GREEN\",IF(AND(S4>3,S4<7),\"YELLOW\",IF(AND(S4>7,S4<10),\"AMBER\",IF(AND(S4>9,S4<17),\"RED\",\"ERROR\"))))","v":"RED"},{"$f":"O4*P4","v":12},"Up"]
[null,2,"Surging inflation restricts our capacity to invest. ","CFO","CFO","Inflation erodes our purchasing power and more resource is consumed with operating the estate (including energy, construction and repair materials). Market pressure pushes up recruitment and staff costs. ",4,4,"n","RED",16,"Treat","We are experiencing high levels of inflation on pay,  insurance, maintenance and utitlities which are well in excess of three  year plan levels, so impact has been increased.  The higher costs are included within the regular monthly MMR forecasts and savings meetings are being held with Schools and Estates/IT Directorates. We continue to aim to maximise all revenue streams and manage costs to minimise the risk.","In place",2,4,"n","AMBER",8,"Up"]
[null,3,"Geopolitical disruptions could cut off student income from one or more markets with little warning. ","CFO","CFO","Outstanding income could be at risk of non payment (eg as happened with fees due from a government sponsoring agency in Ghana) or students are prevented from attending. This risk is relative to both govt agencies such as AFG, partners such as GSS and individual students.",3,4,"n","RED",12,"Treat","Debts have risen in 2022/23, largely due to increases in funds due from GSS. However, dialogue is on-going and a payment plan has been agreed. However, the risk rating has been increased to reflect the current level of debt and economic situation in Nigeria.","In place",3,4,"n","RED",12,"Up"]
{"$rows_left_out":10}
{"sheet":"Estates and Facilities","index":5,"n_rows":23,"n_cols":20,"rows_kept":23,"cut":false,"hidden":false,"merged":[[0,1,0,2],[0,3,0,5],[2,8,2,10],[2,16,2,18]]}
[null,"Strategic Risk Area:",null,"Estates and Facilities"]
[]
[null,"No.","Risk  (what could happen)","Risk Owner","Risk Manager","Consequences (how would this affect the University)","Likelihood","Impact","Unmitigated Score\n(gross)",null,null,"Response","Mitigations (what is being/has been done to control the risk) ","Status (in place/in progress/under consideration)","Likelihood","Impact","Mitigated Score\n(net)",null,null,"Risk Movement"]
[null,1,"New risk added August 2023                     Property Terrier  Lack of comprehensive land, property, building, commercial and service information, data, digital systems to store, manage and report","SVP","DoEF","1) inability to manage efficiently or plan strategically \n2) missing or unreliable sources of information to base decisions upon\n 3) basic property ownership and interest queries are very time consuming\n 4) income not being recovered correctly from external parties\n 5) potenial risks associated with unknown property related liabilities \n6) potential to miss income or value generating opportunities\n 7) reputational damage of note being accountable for heritable assets\n 8) the financial statements do not reflect the heritable assets",4,3,"n","RED",12,"Treat","1) create and maintain a dynamic property terrier 2) fully resource an estate management function","Under consideration",4,3,"n","RED",12,"New Risk"]
[null,2,"New risk added August 2023               Strategic Alignment    Lack of alignment of estates strategy and mangement with corporate priorities and strategy  ","SVP","DoEF","1) failure to anticipate and intepret future real estate requirements\n 2) failure to be able to deliver real estate solutions to meet operational requirements\n 3) failure to plan resources to be able to deliver real estate solutions \n4) risk that future potential income streams will be put less likely to succeed",4,3,"n","RED",12,"Treat","1) formulate manner in which to gather and articulate business strategies and priorities \n2) formulate manner to become aware and be able to anticipate major funding and research income that will create requirement for real estate investment \n3) create a portfolio of potential investment projects with corresponding funding opportunities to provide best opportunity to deliver timely property solutions ","Under consideration",4,3,"n","RED",12,"New Risk"]
[null,3,"New risk added August 2023   Strategic role of Estates in corporate finance The management of the value and potential opporutnities and risks of the heritable assets on the university's balance sheet and income statements is not managed or exploited  ","SVP","DoEF","1) the interests and values on the balance sheet do not fully represent the university's estate \n2) opportunities to leverage the value of heritable assets could be missed \n3) opportunity to recover outstanding payments may be missed \n4) opportunity to effectively manage estates costs are missed\n 5) failure to fully represent property economics in property investment analysis",4,3,"n","RED",12,"Treat","1) closer co-ordination between Finance and Estates to explore role of heritable assets in financial statements \n2) Estates to be proactive participants in creating RAM charges\n 3) Estates to be proactive in supporting management of unpaid rental debt","1) in progress 2) under consideration 3) under consideration",4,3,"n","RED",12,"New Risk"]
{"$rows_left_out":18}
{"sheet":"Education (UG and PGT)","index":6,"n_rows":15,"n_cols":20,"rows_kept":15,"cut":false,"hidden":false,"merged":[[0,1,0,2],[0,3,0,5],[2,8,2,10],[2,16,2,18]]}
[null,"Strategic Risk Area:",null,"Education (UG and PGT)"]
[]
[null,"No.","Risk  (what could happen)","Risk Owner","Risk Manager","Consequences (how would this affect the University)","Likelihood","Impact","Unmitigated Score\n(gross)",null,null,"Response","Mitigations (what is being/has been done to control the risk) ","Status (in place/in progress/under consideration)","Likelihood","Impact","Mitigated Score\n(net)",null,null,"Risk Movement"]
[null,1,"Assessment and feedback on assessment is not of a high quality and / or provided within the required timeframes.\n\n","VP E\n","Director of Academic Services & Online Education","Impact on student performance and progression\n\nNSS Assessment and Feedback results do not improve with impact on League Table rankings\n\n",4,3,"n",{"$f":"IF(K4<4,\"GREEN\",IF(AND(K4>3,K4<7),\"YELLOW\",IF(AND(K4>7,K4<10),\"AMBER\",IF(AND(K4>9,K4<17),\"RED\",\"ERROR\"))))","v":"RED"},{"$f":"G4*H4","v":12},"Treat","Continue with the agreed approach to monitoring the timeliness of providing student feedback at School level so that Heads of School / Directors of Education can intervene where necessary\n\nContinue with the agreed approach that ensures that all students are provided with all information about assessment (including but not limited to: type of assessment, criteria for marking, timelines for submission and return of grades/feedback)\n\nTake forward actions at institutional level that support Schools to improve feedback (e.g., provision of training)\n\nTake forward a pilot of the use of TESTA (Transforming the experience of students through assessment) in one or more School\n\nIdentify good practice in assessment at course, discipline and / or School levels and disseminate appropriately\n\nEach School will review the NSS results at discipline level and will put in place action plans at discipline level\n\nQuality assurance processes in place to ensure appropriate assessment is in place, including liaison with external examiners\n\nGuidance in place on assessment: development of assessment, inclusivity, integrity with continued work on matters of integrity (e.g., essay mills)\n\n\n","In place\n\n\n\nIn place\n\n\n\n\nIn place\n\n\nIn progress (complete in AY23/24)\n\nIn progress (complete in AY23/24)\n\nIn place\n\n\nIn place\n\n\nIn place\n\n\n",2,3,"n",{"$f":"IF(S4<4,\"GREEN\",IF(AND(S4>3,S4<7),\"YELLOW\",IF(AND(S4>7,S4<10),\"AMBER\",IF(AND(S4>9,S4<17),\"RED\",\"ERROR\"))))","v":"YELLOW"},{"$f":"O4*P4","v":6},"No Change"]
[null,2,"Non-continuation of students with some student groups being more at risk of non-continuation","VP E\n","Director of Academic Services & Online Education","Impact on individual students\n\nLoss of tuition fee income\n\nImpact on completion rates, degree awarding gap, and League Table position\n\nReputational impact\n\n",3,3,"n",{"$f":"IF(K5<4,\"GREEN\",IF(AND(K5>3,K5<7),\"YELLOW\",IF(AND(K5>7,K5<10),\"AMBER\",IF(AND(K5>9,K5<17),\"RED\",\"ERROR\"))))","v":"AMBER"},9,"Treat","Continued development of transition into university support, orientation and induction approaches to support the needs of students\n\nAnalysis of non-continuation data that enables targeted initiatives to be developed as necessary at institutional, School and discipline levels\n\nMonthly review of withdrawal data to enable 'real-time' understanding of any trends or concerns\n\nAnalysis of particular demographic groups to determine if there are issues associated with particular groups, and take action to address the issues\n\nOngoing equality impact assessment of teaching, learning and assessment and take action where necessary\n\n","In place\n\n\nIn place\n\n\nUnder consideration\n\n\nIn place\n\n\nOngoing",2,2,"n",{"$f":"IF(S5<4,\"GREEN\",IF(AND(S5>3,S5<7),\"YELLOW\",IF(AND(S5>7,S5<10),\"AMBER\",IF(AND(S5>9,S5<17),\"RED\",\"ERROR\"))))","v":"YELLOW"},4,"No Change"]
[null,3,"No increase in the level of student mobility / students' opportunity to engage with an international experience","VP E\n","Director of External Relations","Impact on student experience due to lack of opportunity to undertake international placements\n\nImpact on recruitment\n\nImpact on the achievement of the Aberdeen 2040 Commitment 11\n",3,3,"n","AMBER",9,"Treat","International TFG is taking forward planning that aims to increase the number of opportunities for study abroad\n\nTake forward a pilot of COIL (Collaborative Online International Learning) that aims to enable students to have an international experience without travel\n\nCommunicate the existing opportunities appropriately\n\nContinue to work with networks (e.g., Aurora, Curtin) to progress increased opportunities for student mobility\n\nContinue to work at a national level to influence the approach to the funding for study abroad","In progress (this is a long-term and ongoing action)\n\nIn progress (complete in AY23/24)\n\nIn place\n\nIn place\n\n\nIn place",2,2,"n","YELLOW",4,"No Change"]
{"$rows_left_out":9}